Reaction Details
TargetIndoleamine 2,3-dioxygenase 1
LigandBDBM24778
Substrate/Competitorn/a
Meas. Tech.ChEMBL_1709125 (CHEMBL4119174)
IC50 370±n/a nM
Citation Son, SKo, SKJang, MLee, JKKwon, MCKang, DHRyoo, IJLee, JSHong, YSKim, BYJang, JHAhn, JS Polyketides and Anthranilic Acid Possessing 6-Deoxy-?-l-talopyranose from a Streptomyces Species. J Nat Prod80:1378-1386 (2017) 
 
Indoleamine 2,3-dioxygenase 1
Name:Indoleamine 2,3-dioxygenase 1
Type:Enzyme
Mol. Mass.:45330.80
Organism:Homo sapiens (Human)
Description:P14902
Residue:403
BDBM24778
NameBDBM24778
Synonyms:2-methyl-1,4-dihydronaphthalene-1,4-dione CHEMBL590 Menadione (5d) Menadione, 9 cid_4055
TypeSmall organic molecule
Emp. Form.C11H8O2
Mol. Mass.172.18
SMILESCC1=CC(=O)c2ccccc2C1=O