Reaction Details
TargetCysteinyl leukotriene receptor 1
LigandBDBM50013550
Substrate/Competitorn/a
Meas. Tech.ChEBML_52211
Ki 2.9±n/a nM
Citation Huang, FCGalemmo, RAJohnson, WHPoli, GBMorrissette, MMMencel, JJWarus, JDCampbell, HFNuss, GWCarnathan, GW Development of a novel series of (2-quinolinylmethoxy)phenyl-containing compounds as high-affinity leukotriene D4 receptor antagonists. 2. Effects of an additional phenyl ring on receptor affinity. J Med Chem33:1194-200 (1990) Cysteinyl leukotriene receptor 1
Name:Cysteinyl leukotriene receptor 1
Type:Enzyme Catalytic Domain
Mol. Mass.:39007.58
Organism:GUINEA PIG
Description:Leukotriene D4 0 GUINEA PIG::Q2NNR5
Residue:340
BDBM50013550
NameBDBM50013550
Synonyms:2-{3-[4-(1H-Tetrazol-5-yl)-phenoxymethyl]-phenoxymethyl}-quinoline | CHEMBL276136
TypeSmall organic molecule
Emp. Form.C24H19N5O2
Mol. Mass.409.44
SMILESC(Oc1ccc(cc1)-c1nnn[nH]1)c1cccc(OCc2ccc3ccccc3n2)c1