Reaction Details
TargetCysteinyl leukotriene receptor 1
LigandBDBM50013560
Substrate/Competitorn/a
Meas. Tech.ChEBML_52211
Ki 8±n/a nM
Citation Huang, FCGalemmo, RAJohnson, WHPoli, GBMorrissette, MMMencel, JJWarus, JDCampbell, HFNuss, GWCarnathan, GW Development of a novel series of (2-quinolinylmethoxy)phenyl-containing compounds as high-affinity leukotriene D4 receptor antagonists. 2. Effects of an additional phenyl ring on receptor affinity. J Med Chem33:1194-200 (1990) Cysteinyl leukotriene receptor 1
Name:Cysteinyl leukotriene receptor 1
Type:Enzyme Catalytic Domain
Mol. Mass.:39007.58
Organism:GUINEA PIG
Description:Leukotriene D4 0 GUINEA PIG::Q2NNR5
Residue:340
BDBM50013560
NameBDBM50013560
Synonyms:2-{4-[3-(1H-Tetrazol-5-ylmethoxy)-benzyloxy]-phenoxymethyl}-quinoline | CHEMBL18956
TypeSmall organic molecule
Emp. Form.C25H21N5O3
Mol. Mass.439.4659
SMILESC(Oc1cccc(COc2ccc(OCc3ccc4ccccc4n3)cc2)c1)c1nnn[nH]1