Reaction Details
TargetCysteinyl leukotriene receptor 1
LigandBDBM50006799
Substrate/Competitorn/a
Meas. Tech.ChEBML_52211
Ki 3±n/a nM
Citation Huang, FCGalemmo, RAJohnson, WHPoli, GBMorrissette, MMMencel, JJWarus, JDCampbell, HFNuss, GWCarnathan, GW Development of a novel series of (2-quinolinylmethoxy)phenyl-containing compounds as high-affinity leukotriene D4 receptor antagonists. 2. Effects of an additional phenyl ring on receptor affinity. J Med Chem33:1194-200 (1990) Cysteinyl leukotriene receptor 1
Name:Cysteinyl leukotriene receptor 1
Type:Enzyme Catalytic Domain
Mol. Mass.:39007.58
Organism:GUINEA PIG
Description:Leukotriene D4 0 GUINEA PIG::Q2NNR5
Residue:340
BDBM50006799
NameBDBM50006799
Synonyms:2-{4-[2-(1H-Tetrazol-5-ylmethyl)-benzyloxy]-phenoxymethyl}-quinoline 2-{4-[2-(1H-Tetrazol-5-ylmethyl)-benzyloxy]-phenoxymethyl}-quinoline(RG 12525) RG-12525
TypeSmall organic molecule
Emp. Form.C25H21N5O2
Mol. Mass.423.4665
SMILESC(Oc1ccc(OCc2ccccc2Cc2nnn[nH]2)cc1)c1ccc2ccccc2n1