Reaction Details
TargetCysteinyl leukotriene receptor 1
LigandBDBM50013544
Substrate/Competitorn/a
Meas. Tech.ChEBML_52211
Ki 4.3±n/a nM
Citation Huang, FCGalemmo, RAJohnson, WHPoli, GBMorrissette, MMMencel, JJWarus, JDCampbell, HFNuss, GWCarnathan, GW Development of a novel series of (2-quinolinylmethoxy)phenyl-containing compounds as high-affinity leukotriene D4 receptor antagonists. 2. Effects of an additional phenyl ring on receptor affinity. J Med Chem33:1194-200 (1990) Cysteinyl leukotriene receptor 1
Name:Cysteinyl leukotriene receptor 1
Type:Enzyme Catalytic Domain
Mol. Mass.:39007.58
Organism:GUINEA PIG
Description:Leukotriene D4 0 GUINEA PIG::Q2NNR5
Residue:340
BDBM50013544
NameBDBM50013544
Synonyms:2-{3-[2-Methoxy-4-(1H-tetrazol-5-yl)-benzyloxy]-phenoxymethyl}-quinoline | CHEMBL18589
TypeSmall organic molecule
Emp. Form.C25H21N5O3
Mol. Mass.439.4659
SMILESCOc1cc(ccc1COc1cccc(OCc2ccc3ccccc3n2)c1)-c1nnn[nH]1