Reaction Details
TargetCysteinyl leukotriene receptor 1
LigandBDBM50013901
Substrate/Competitorn/a
Meas. Tech.ChEBML_52379
Ki 11±n/a nM
Citation Galemmo, RAJohnson, WHLearn, KSLee, TDHuang, FCCampbell, HFYoussefyeh, RO'Rourke, SVSchuessler, GSweeney, DM The development of a novel series of (quinolin-2-ylmethoxy)phenyl-containing compounds as high-affinity leukotriene receptor antagonists. 3. Structural variation of the acidic side chain to give antagonists of enhanced potency. J Med Chem33:2828-41 (1990) Cysteinyl leukotriene receptor 1
Name:Cysteinyl leukotriene receptor 1
Type:Enzyme Catalytic Domain
Mol. Mass.:38565.16
Organism:Homo sapiens (Human)
Description:Leukotriene Cysteinyl 1 CYSLTR1 HUMAN::Q9Y271
Residue:337
BDBM50013901
NameBDBM50013901
Synonyms:2-(4-{2-[2-(1H-Tetrazol-5-yl)-ethyl]-pentyl}-phenoxymethyl)-quinoline | CHEMBL97356
TypeSmall organic molecule
Emp. Form.C24H27N5O
Mol. Mass.401.5041
SMILESCCCC(CCc1nnn[nH]1)Cc1ccc(OCc2ccc3ccccc3n2)cc1