Reaction Details
TargetRenin
LigandBDBM50014129
Substrate/Competitorn/a
Meas. Tech.ChEBML_195951
IC50 31000±n/a nM
Citation Dutta, ASGormley, JJMcLachlan, PFMajor, JS Inhibitors of human renin. Cyclic peptide analogues containing a D-Phe-Lys-D-Trp sequence. J Med Chem33:2560-8 (1990) Renin
Name:Renin
Type:Enzyme
Mol. Mass.:45058.99
Organism:Homo sapiens (Human)
Description:n/a
Residue:406
BDBM50014129
NameBDBM50014129
Synonyms:2-[2-[6-Amino-2-(2-benzyloxycarbonylamino-3-phenyl-propionylamino)-hexanoylamino]-3-(1H-indol-3-yl)-propionylamino]-4-methyl-pentanoic acid methyl ester | CHEMBL313217
TypeSmall organic molecule
Emp. Form.C41H52N6O7
Mol. Mass.740.8876
SMILESCOC(=O)[C@H](CC(C)C)NC(=O)[C@H](Cc1c[nH]c2ccccc12)NC(=O)[C@H](CCCCN)NC(=O)[C@H](Cc1ccccc1)NC(=O)OCc1ccccc1