Reaction Details
TargetRenin
LigandBDBM50014131
Substrate/Competitorn/a
Meas. Tech.ChEBML_195951
IC50 40000±n/a nM
Citation Dutta, ASGormley, JJMcLachlan, PFMajor, JS Inhibitors of human renin. Cyclic peptide analogues containing a D-Phe-Lys-D-Trp sequence. J Med Chem33:2560-8 (1990) Renin
Name:Renin
Type:Enzyme
Mol. Mass.:45058.99
Organism:Homo sapiens (Human)
Description:n/a
Residue:406
BDBM50014131
NameBDBM50014131
Synonyms:2-[2-[3-(Acetylamino-methylsulfanyl)-2-(2-tert-butoxycarbonylamino-3-phenyl-propionylamino)-propionylamino]-3-(1H-indol-3-yl)-propionylamino]-4-methyl-pentanoic acid methyl ester | CHEMBL313089
TypeSmall organic molecule
Emp. Form.C38H52N6O8S
Mol. Mass.752.92
SMILESCOC(=O)[C@H](CC(C)C)NC(=O)[C@H](Cc1c[nH]c2ccccc12)NC(=O)[C@H](CSCNC(C)=O)NC(=O)[C@H](Cc1ccccc1)NC(=O)OC(C)(C)C