Reaction Details
TargetSteroid 17-alpha-hydroxylase/17,20 lyase
LigandBDBM50274157
Substrate/Competitorn/a
Meas. Tech.ChEMBL_1713960 (CHEMBL4124009)
IC50 1.000000±n/a nM
Citation Blass, BEIyer, PAbou-Gharbia, MChilders, WEGordon, JCRamanjulu, MMorton, GArumugam, PBoruwa, JEllingboe, JMitra, SReddy Nimmareddy, RPaliwal, SRajasekhar, JShivakumar, SSrivastava, PTangirala, RSVenkataramanaiah, KBobbala, RYanamandra, MKrishnakanth Reddy, L Design and synthesis of functionalized piperazin-1yl-(E)-stilbenes as inhibitors of 17?-hydroxylase-C17,20-lyase (Cyp17). Bioorg Med Chem Lett28:2270-2274 (2018) 
 
Steroid 17-alpha-hydroxylase/17,20 lyase
Name:Steroid 17-alpha-hydroxylase/17,20 lyase
Type:Enzyme
Mol. Mass.:57382.42
Organism:Homo sapiens (Human)
Description:E.coli expressing human CYP17
Residue:508
BDBM50274157
NameBDBM50274157
Synonyms:CHEMBL4127656
TypeSmall organic molecule
Emp. Form.C26H28FN3O2S
Mol. Mass.465.583
SMILESCC(C)S(=O)(=O)N1CCN(CC1)c1ccc(\C=C\c2cc(F)cc(c2)-c2ccncc2)cc1