Reaction Details
TargetEpidermal growth factor receptor
LigandBDBM50029668
Substrate/Competitorn/a
Meas. Tech.ChEMBL_1714364 (CHEMBL4124413)
IC50 0.900000±n/a nM
Citation Zhang, HWang, JZhao, HYYang, XYLei, HXin, MCao, YXZhang, SQ Synthesis and biological evaluation of irreversible EGFR tyrosine kinase inhibitors containing pyrido[3,4-d]pyrimidine scaffold. Bioorg Med Chem26:3619-3633 (2018) 
 
Epidermal growth factor receptor
Name:Epidermal growth factor receptor
Type:Receptor Kinase Domain
Mol. Mass.:134279.59
Organism:Homo sapiens (Human)
Description:P00533
Residue:1210
BDBM50029668
NameBDBM50029668
Synonyms:AZD-9291 US10085983, Compound AZD-9291 US11111233, Example AZD9291 US20230322822, Compound AZD9291 WO2022090481, Example osimertinib
TypeSmall organic molecule
Emp. Form.C28H33N7O2
Mol. Mass.499.6073
SMILESCOc1cc(N(C)CCN(C)C)c(NC(=O)C=C)cc1Nc1nccc(n1)-c1cn(C)c2ccccc12