Reaction Details
TargetCarboxypeptidase B2
LigandBDBM50275212
Substrate/Competitorn/a
Meas. Tech.ChEMBL_1714513 (CHEMBL4124562)
IC50 1.5±n/a nM
Citation Itoh, TYoshimoto, NHirano, YYamamoto, K Structural basis for the selective inhibition of activated thrombin-activatable fibrinolysis inhibitor (TAFIa) by a selenium-containing inhibitor with chloro-aminopyridine as a basic group. Bioorg Med Chem Lett28:2256-2260 (2018) 
 
Carboxypeptidase B2
Name:Carboxypeptidase B2
Type:Enzyme
Mol. Mass.:48432.74
Organism:Homo sapiens (Human)
Description:Q96IY4
Residue:423
BDBM50275212
NameBDBM50275212
Synonyms:CHEMBL4127473
TypeSmall organic molecule
Emp. Form.C12H15ClN2O3Se
Mol. Mass.349.67
SMILES[#6]-[#6]-[#6](=O)[Se;v2][#6]-[#6](-[#6]-c1cnc(-[#7])c(Cl)c1)-[#6](-[#8])=O