Reaction Details
TargetDihydrofolate reductase
LigandBDBM50014707
Substrate/Competitorn/a
Meas. Tech.ChEMBL_54590 (CHEMBL667313)
Ki 3000±n/a nM
Citation DeGraw, JIChristie, PHKisliuk, RLGaumont, YSirotnak, FM Synthesis and antifolate properties of 9-alkyl-10-deazaminopterins. J Med Chem33:212-5 (1990) Dihydrofolate reductase
Name:Dihydrofolate reductase
Type:Enzyme
Mol. Mass.:21608.82
Organism:Mus musculus (Mouse)
Description:n/a
Residue:187
BDBM50014707
NameBDBM50014707
Synonyms:2-{4-[2-(2,4-Diamino-pteridin-6-yl)-propyl]-benzoylamino}-pentanedioic acid | CHEMBL431359
TypeSmall organic molecule
Emp. Form.C21H23N7O5
Mol. Mass.453.4512
SMILESCC(Cc1ccc(cc1)C(=O)NC(CCC(O)=O)C(O)=O)c1cnc2nc(N)nc(N)c2n1