Reaction Details
TargetDihydrofolate reductase
LigandBDBM50014706
Substrate/Competitorn/a
Meas. Tech.ChEMBL_54597 (CHEMBL667320)
Ki 0.005500±n/a nM
Citation DeGraw, JIChristie, PHKisliuk, RLGaumont, YSirotnak, FM Synthesis and antifolate properties of 9-alkyl-10-deazaminopterins. J Med Chem33:212-5 (1990) Dihydrofolate reductase
Name:Dihydrofolate reductase
Type:Enzyme
Mol. Mass.:21608.82
Organism:Mus musculus (Mouse)
Description:n/a
Residue:187
BDBM50014706
NameBDBM50014706
Synonyms:2-{4-[2-(2,4-Diamino-pteridin-6-yl)-butyl]-benzoylamino}-pentanedioic acid | CHEMBL302068
TypeSmall organic molecule
Emp. Form.C22H25N7O5
Mol. Mass.467.4778
SMILESCCC(Cc1ccc(cc1)C(=O)NC(CCC(O)=O)C(O)=O)c1cnc2nc(N)nc(N)c2n1