Reaction Details
TargetChymotrypsin-like elastase family member 1
LigandBDBM50014734
Substrate/Competitorn/a
Meas. Tech.ChEBML_63628
Ki 660.0±n/a nM
Citation Peet, NPBurkhart, JPAngelastro, MRGiroux, ELMehdi, SBey, PKolb, MNeises, BSchirlin, D Synthesis of peptidyl fluoromethyl ketones and peptidyl alpha-keto esters as inhibitors of porcine pancreatic elastase, human neutrophil elastase, and rat and human neutrophil cathepsin G. J Med Chem33:394-407 (1990) Chymotrypsin-like elastase family member 1
Name:Chymotrypsin-like elastase family member 1
Type:PROTEIN
Mol. Mass.:27805.35
Organism:Homo sapiens (Human)
Description:ChEMBL_63626
Residue:258
BDBM50014734
NameBDBM50014734
Synonyms:CHEMBL132768 | N-{1-Benzyl-2-oxo-2-[2-(3,3,3-trifluoro-1-isopropyl-2-oxo-propylcarbamoyl)-pyrrolidin-1-yl]-ethyl}-succinamic acid methyl ester
TypeSmall organic molecule
Emp. Form.C25H32F3N3O6
Mol. Mass.527.5333
SMILESCOC(=O)CCC(=O)N[C@H](Cc1ccccc1)C(=O)N1CCC[C@H]1C(=O)N[C@@H](C(C)C)C(=O)C(F)(F)F