Reaction Details
TargetChymotrypsin-like elastase family member 1
LigandBDBM50014742
Substrate/Competitorn/a
Meas. Tech.ChEBML_63628
Ki 24000±n/a nM
Citation Peet, NPBurkhart, JPAngelastro, MRGiroux, ELMehdi, SBey, PKolb, MNeises, BSchirlin, D Synthesis of peptidyl fluoromethyl ketones and peptidyl alpha-keto esters as inhibitors of porcine pancreatic elastase, human neutrophil elastase, and rat and human neutrophil cathepsin G. J Med Chem33:394-407 (1990) Chymotrypsin-like elastase family member 1
Name:Chymotrypsin-like elastase family member 1
Type:PROTEIN
Mol. Mass.:27805.35
Organism:Homo sapiens (Human)
Description:ChEMBL_63626
Residue:258
BDBM50014742
NameBDBM50014742
Synonyms:Acetyl-Ala-Ala-Pro-Ala-trifluromethane | CHEMBL130128
TypeSmall organic molecule
Emp. Form.C17H25F3N4O5
Mol. Mass.422.3994
SMILESC[C@H](NC(C)=O)C(=O)N[C@@H](C)C(=O)N1CCC[C@H]1C(=O)N[C@@H](C)C(=O)C(F)(F)F