Reaction Details
TargetDihydrofolate reductase
LigandBDBM50008285
Substrate/Competitorn/a
Meas. Tech.ChEBML_54604
Ki 0.013000±n/a nM
Citation DeGraw, JIChristie, PHKisliuk, RLGaumont, YSirotnak, FM Synthesis and antifolate properties of 10-alkyl-5,10-dideaza analogues of methotrexate and tetrahydrofolic acid. J Med Chem33:673-7 (1990) Dihydrofolate reductase
Name:Dihydrofolate reductase
Type:Enzyme
Mol. Mass.:21608.82
Organism:Mus musculus (Mouse)
Description:n/a
Residue:187
BDBM50008285
NameBDBM50008285
Synonyms:2-{4-[1-(2,4-Diamino-pyrido[2,3-d]pyrimidin-6-ylmethyl)-propyl]-benzoylamino}-pentanedioic acid | CHEMBL113799
TypeSmall organic molecule
Emp. Form.C23H26N6O5
Mol. Mass.466.4897
SMILESCCC(Cc1cnc2nc(N)nc(N)c2c1)c1ccc(cc1)C(=O)NC(CCC(O)=O)C(O)=O