Reaction Details
TargetLysine-specific histone demethylase 2
LigandBDBM50278411
Substrate/Competitorn/a
Meas. Tech.ChEMBL_1720163 (CHEMBL4135163)
IC50 6770±n/a nM
Citation Ji, YYLin, SDWang, YJSu, MBZhang, WGunosewoyo, HYang, FLi, JTang, JZhou, YBYu, LF Tying up tranylcypromine: Novel selective histone lysine specific demethylase 1 (LSD1) inhibitors. Eur J Med Chem141:101-112 (2017) 
 
Lysine-specific histone demethylase 2
Name:Lysine-specific histone demethylase 2
Type:PROTEIN
Mol. Mass.:92112.91
Organism:Homo sapiens (Human)
Description:ChEMBL_992590
Residue:822
BDBM50278411
NameBDBM50278411
Synonyms:CHEMBL4170367
TypeSmall organic molecule
Emp. Form.C16H23ClN2
Mol. Mass.278.82
SMILESCl.[H][C@]12Cc3ccccc3[C@@]1([H])[C@@]2([H])N[C@H]1CC[C@H](N)CC1