Reaction Details
TargetLysine-specific histone demethylase 2
LigandBDBM50278484
Substrate/Competitorn/a
Meas. Tech.ChEMBL_1720163 (CHEMBL4135163)
IC50 1430±n/a nM
Citation Ji, YYLin, SDWang, YJSu, MBZhang, WGunosewoyo, HYang, FLi, JTang, JZhou, YBYu, LF Tying up tranylcypromine: Novel selective histone lysine specific demethylase 1 (LSD1) inhibitors. Eur J Med Chem141:101-112 (2017) 
 
Lysine-specific histone demethylase 2
Name:Lysine-specific histone demethylase 2
Type:PROTEIN
Mol. Mass.:92112.91
Organism:Homo sapiens (Human)
Description:ChEMBL_992590
Residue:822
BDBM50278484
NameBDBM50278484
Synonyms:CHEMBL4170687
TypeSmall organic molecule
Emp. Form.C16H23ClN2
Mol. Mass.278.82
SMILESCl.[H][C@]12Cc3ccccc3[C@@]1([H])[C@H]2NCC1CCNCC1