Reaction Details
TargetCysteinyl leukotriene receptor 1
LigandBDBM50015542
Substrate/Competitorn/a
Meas. Tech.ChEMBL_52225 (CHEMBL666489)
Ki 41±n/a nM
Citation Matassa, VGMaduskuie, TPShapiro, HSHesp, BSnyder, DWAharony, DKrell, RDKeith, RA Evolution of a series of peptidoleukotriene antagonists: synthesis and structure/activity relationships of 1,3,5-substituted indoles and indazoles. J Med Chem33:1781-90 (1990) Cysteinyl leukotriene receptor 1
Name:Cysteinyl leukotriene receptor 1
Type:Enzyme Catalytic Domain
Mol. Mass.:39007.58
Organism:GUINEA PIG
Description:Leukotriene D4 0 GUINEA PIG::Q2NNR5
Residue:340
BDBM50015542
NameBDBM50015542
Synonyms:4-[5-Cyclopentyloxycarbonylamino-1-(2-methoxy-ethyl)-1H-indol-3-ylmethyl]-3-methoxy-benzoic acid | CHEMBL50422
TypeSmall organic molecule
Emp. Form.C26H30N2O6
Mol. Mass.466.5262
SMILESCOCCn1cc(Cc2ccc(cc2OC)C(O)=O)c2cc(NC(=O)OC3CCCC3)ccc12