Reaction Details
TargetCysteinyl leukotriene receptor 1/2
LigandBDBM50227359
Substrate/Competitorn/a
Meas. Tech.ChEMBL_52226 (CHEMBL666490)
Ki 10±n/a nM
Citation Matassa, VGMaduskuie, TPShapiro, HSHesp, BSnyder, DWAharony, DKrell, RDKeith, RA Evolution of a series of peptidoleukotriene antagonists: synthesis and structure/activity relationships of 1,3,5-substituted indoles and indazoles. J Med Chem33:1781-90 (1990) Cysteinyl leukotriene receptor 1/2
Name:Cysteinyl leukotriene receptor 1/2
Synonyms:Cysteinyl leukotriene receptor
Type:n/a
Mol. Mass.:n/a
Description:ASSAY_ID of ChEMBL is 98640
Components:This complex has 2 components.
Component 1
Name:Cysteinyl leukotriene receptor 1
Type:Enzyme Catalytic Domain
Mol. Mass.:38565.16
Organism:Homo sapiens (Human)
Description:Leukotriene Cysteinyl 1 CYSLTR1 HUMAN::Q9Y271
Residue:337
Component 2
Name:Cysteinyl leukotriene receptor 2
Synonyms:CLTR2_HUMAN CYSLT2R Cysteinyl leukotriene receptor Leukotriene Cysteinyl 2
Type:Enzyme Catalytic Domain
Mol. Mass.:39657.52
Organism:Homo sapiens (Human)
Description:Leukotriene Cysteinyl 2 CYSLTR2 HUMAN::Q9NS75
Residue:346
BDBM50227359
NameBDBM50227359
Synonyms:CHEMBL51061
TypeSmall organic molecule
Emp. Form.C32H31N3O4
Mol. Mass.521.6062
SMILESCOc1cc(ccc1Cc1cn(Cc2cccc(c2)C#N)c2ccc(NC(=O)CC3CCCC3)cc12)C(O)=O