Reaction Details
TargetSerine/threonine-protein kinase PknB
LigandBDBM50279744
Substrate/Competitorn/a
Meas. Tech.ChEMBL_1721605 (CHEMBL4136605)
Ki<2.0±n/a nM
Citation Wang, TBemis, GHanzelka, BZuccola, HWynn, MMoody, CSGreen, JLocher, CLiu, AGao, HXu, YWang, SWang, JBennani, YLThomson, JAMüh, U Mtb PKNA/PKNB Dual Inhibition Provides Selectivity Advantages for Inhibitor Design To Minimize Host Kinase Interactions. ACS Med Chem Lett8:1224-1229 (2017) 
 
Serine/threonine-protein kinase PknB
Name:Serine/threonine-protein kinase PknB
Type:PROTEIN
Mol. Mass.:66497.93
Organism:Mycobacterium tuberculosis
Description:ChEMBL_774233
Residue:626
BDBM50279744
NameBDBM50279744
Synonyms:CHEMBL4165984
TypeSmall organic molecule
Emp. Form.C15H13N7O2S2
Mol. Mass.387.439
SMILESNS(=O)(=O)c1ccc(s1)-c1ncc(C#N)c(Nc2cc([nH]n2)C2CC2)n1