Reaction Details
TargetD(1A) dopamine receptor
LigandBDBM50016006
Substrate/Competitorn/a
Meas. Tech.ChEBML_58328
IC50 561±n/a nM
Citation Schaus, JMTitus, RDForeman, MMMason, NRTruex, LL Aporphines as antagonists of dopamine D-1 receptors. J Med Chem33:600-7 (1990) D(1A) dopamine receptor
Name:D(1A) dopamine receptor
Type:Enzyme Catalytic Domain
Mol. Mass.:49429.75
Organism:RAT
Description:P18901
Residue:446
BDBM50016006
NameBDBM50016006
Synonyms:8-Chloro-6-methyl-5,6,6a,7-tetrahydro-4H-dibenzo[de,g]quinolin-11-ol | CHEMBL153960
TypeSmall organic molecule
Emp. Form.C17H16ClNO
Mol. Mass.285.768
SMILESCN1CCc2cccc-3c2[C@H]1Cc1c(Cl)ccc(O)c-31