Reaction Details
TargetD(1A) dopamine receptor
LigandBDBM50016015
Substrate/Competitorn/a
Meas. Tech.ChEBML_58328
IC50>1000±n/a nM
Citation Schaus, JMTitus, RDForeman, MMMason, NRTruex, LL Aporphines as antagonists of dopamine D-1 receptors. J Med Chem33:600-7 (1990) D(1A) dopamine receptor
Name:D(1A) dopamine receptor
Type:Enzyme Catalytic Domain
Mol. Mass.:49429.75
Organism:RAT
Description:P18901
Residue:446
BDBM50016015
NameBDBM50016015
Synonyms:9-Bromo-6-methyl-5,6,6a,7-tetrahydro-4H-dibenzo[de,g]quinolin-11-ol | CHEMBL157735
TypeSmall organic molecule
Emp. Form.C17H16BrNO
Mol. Mass.330.219
SMILESCN1CCc2cccc-3c2[C@@H]1Cc1cc(Br)cc(O)c-31