Reaction Details
TargetSubstance-P receptor
LigandBDBM50452295
Substrate/Competitorn/a
Meas. Tech.ChEMBL_143534 (CHEMBL883402)
EC50 1300±n/a nM
Citation Laufer, RGilon, CChorev, MSelinger, Z [pGlu6,Pro9]SP6-11, a selective agonist for the substance P P-receptor subtype. J Med Chem29:1284-8 (1987) Substance-P receptor
Name:Substance-P receptor
Type:Enzyme Catalytic Domain
Mol. Mass.:46261.42
Organism:GUINEA PIG
Description:Neurokinin NK1 TACR1 GUINEA PIG::P30547
Residue:407
BDBM50452295
NameBDBM50452295
Synonyms:CHEMBL2371799
TypeSmall organic molecule
Emp. Form.C39H55N7O8S
Mol. Mass.781.961
SMILESCSCC[C@H](NC(=O)[C@H](CC(C)C)NC(=O)[C@@H]1CCCN1C(=O)[C@H](Cc1ccccc1)NC(=O)[C@H](Cc1ccccc1)NC(=O)[C@@H](N)CCC(O)=O)C(N)=O