Reaction Details
TargetCholecystokinin receptor type A/Gastrin/cholecystokinin type B receptor
LigandBDBM50016424
Substrate/Competitorn/a
Meas. Tech.ChEMBL_49551 (CHEMBL664276)
Ki 120±n/a nM
Citation Charpentier, BDurieux, CMenant, IRoques, BP Investigation of peripheral cholecystokinin receptor heterogeneity by cyclic and related linear analogues of CCK26-33: synthesis and biological properties. J Med Chem30:962-8 (1987) Cholecystokinin receptor type A/Gastrin/cholecystokinin type B receptor
Name:Cholecystokinin receptor type A/Gastrin/cholecystokinin type B receptor
Synonyms:Cholecystokinin receptor
Type:n/a
Mol. Mass.:n/a
Description:ASSAY_ID of ChEMBL is 49552
Components:This complex has 2 components.
Component 1
Name:Cholecystokinin receptor type A
Type:PROTEIN
Mol. Mass.:48454.29
Organism:Mus musculus
Description:ChEMBL_40042
Residue:436
Component 2
Name:Gastrin/cholecystokinin type B receptor
Synonyms:Cckbr Cholecystokinin receptor Gastrin/cholecystokinin type B receptor
Type:Enzyme Catalytic Domain
Mol. Mass.:49196.59
Organism:MOUSE
Description:Cholecystokinin A CCKBR MOUSE::P56481
Residue:453
BDBM50016424
NameBDBM50016424
Synonyms:CHEMBL216677 | N-(2-Amino-1-benzyl-ethyl)-3-{2-[2-{[9-tert-butoxycarbonylamino-3-butyl-2,5,8,11-tetraoxo-6-(4-sulfooxy-benzyl)-1,4,7,12tetraaza-cycloheptadecane-17-carbonyl]-amino}-3-(1H-indol-3-yl)-propionylamino]-hexanoylamino}-succinamic acid
TypeSmall organic molecule
Emp. Form.C60H83N11O16S
Mol. Mass.1246.43
SMILESCCCC[C@H](NC(=O)C(Cc1c[nH]c2ccccc12)NC(=O)[C@H]1CCCCNC(=O)CC(NC(=O)OC(C)(C)C)C(=O)N[C@H](Cc2ccc(OS(O)(=O)=O)cc2)C(=O)N[C@@H](CCCC)C(=O)N1)C(=O)N[C@@H](CC(O)=O)C(=O)N[C@H](CN)Cc1ccccc1