Reaction Details
TargetCholecystokinin receptor type A/Gastrin/cholecystokinin type B receptor
LigandBDBM50016421
Substrate/Competitorn/a
Meas. Tech.ChEMBL_49551 (CHEMBL664276)
Ki>1000±n/a nM
Citation Charpentier, BDurieux, CMenant, IRoques, BP Investigation of peripheral cholecystokinin receptor heterogeneity by cyclic and related linear analogues of CCK26-33: synthesis and biological properties. J Med Chem30:962-8 (1987) Cholecystokinin receptor type A/Gastrin/cholecystokinin type B receptor
Name:Cholecystokinin receptor type A/Gastrin/cholecystokinin type B receptor
Synonyms:Cholecystokinin receptor
Type:n/a
Mol. Mass.:n/a
Description:ASSAY_ID of ChEMBL is 49552
Components:This complex has 2 components.
Component 1
Name:Cholecystokinin receptor type A
Type:PROTEIN
Mol. Mass.:48454.29
Organism:Mus musculus
Description:ChEMBL_40042
Residue:436
Component 2
Name:Gastrin/cholecystokinin type B receptor
Synonyms:Cckbr Cholecystokinin receptor Gastrin/cholecystokinin type B receptor
Type:Enzyme Catalytic Domain
Mol. Mass.:49196.59
Organism:MOUSE
Description:Cholecystokinin A CCKBR MOUSE::P56481
Residue:453
BDBM50016421
NameBDBM50016421
Synonyms:3-{2-[2-(6-Amino-2-{2-[2-(2-tert-butoxycarbonylamino-3-carboxy-propionylamino)-3-(4-sulfooxy-phenyl)-propionylamino]-hexanoylamino}-hexanoylamino)-3-(1H-indol-3-yl)-propionylamino]-hexanoylamino}-succinamic acid | CHEMBL268849
TypeSmall organic molecule
Emp. Form.C51H74N10O17S
Mol. Mass.1131.255
SMILESCCCC[C@H](NC(=O)[C@H](Cc1c[nH]c2ccccc12)NC(=O)[C@@H](CCCCN)NC(=O)[C@H](CCCC)NC(=O)[C@H](Cc1ccc(OS(O)(=O)=O)cc1)NC(=O)[C@H](CC(O)=O)NC(=O)OC(C)(C)C)C(=O)N[C@@H](CC(O)=O)C(N)=O