Reaction Details
TargetDihydrofolate reductase
LigandBDBM50016461
Substrate/Competitorn/a
Meas. Tech.ChEMBL_55081 (CHEMBL663894)
IC50 20.0±n/a nM
Citation Nair, MGNanavati, NTKumar, PGaumont, YKisliuk, RL Synthesis and biological evaluation of poly-gamma-glutamyl metabolites of 10-deazaaminopterin and 10-ethyl-10-deazaaminopterin. J Med Chem31:181-5 (1988) Dihydrofolate reductase
Name:Dihydrofolate reductase
Type:PROTEIN
Mol. Mass.:18437.08
Organism:Lactobacillus casei
Description:ChEMBL_1357878
Residue:163
BDBM50016461
NameBDBM50016461
Synonyms:(S)-2-{4-[2-(2,4-Diamino-pteridin-6-yl)-ethyl]-benzoylamino}-pentanedioic acid GNF-PF-173
TypeSmall organic molecule
Emp. Form.C20H21N7O5
Mol. Mass.439.4246
SMILESNc1nc(N)c2nc(CCc3ccc(cc3)C(=O)N[C@@H](CCC(O)=O)C(O)=O)cnc2n1