Reaction Details
TargetTrifunctional purine biosynthetic protein adenosine-3
LigandBDBM50016658
Substrate/Competitorn/a
Meas. Tech.ChEBML_70037
IC50 0.018±n/a nM
Comments0.018 20220121
Citation Nair, MGMurthy, BRPatil, SDKisliuk, RLThorndike, JGaumont, YFerone, RDuch, DSEdelstein, MP Folate analogues. 31. Synthesis of the reduced derivatives of 11-deazahomofolic acid, 10-methyl-11-deazahomofolic acid, and their evaluation as inhibitors of glycinamide ribonucleotide formyltransferase. J Med Chem32:1277-83 (1989) Trifunctional purine biosynthetic protein adenosine-3
Name:Trifunctional purine biosynthetic protein adenosine-3
Type:PROTEIN
Mol. Mass.:107504.27
Organism:Mus musculus
Description:ChEMBL_497843
Residue:1010
BDBM50016658
NameBDBM50016658
Synonyms:2-{4-[3-(2-Amino-4-oxo-3,4,5,6,7,8-hexahydro-pteridin-6-yl)-propyl]-benzoylamino}-pentanedioic acid | CHEMBL279302
TypeSmall organic molecule
Emp. Form.C21H26N6O6
Mol. Mass.458.4677
SMILESNc1nc2NCC(CCCc3ccc(cc3)C(=O)NC(CCC(O)=O)C(O)=O)Nc2c(=O)[nH]1