Reaction Details
TargetTrifunctional purine biosynthetic protein adenosine-3
LigandBDBM50016661
Substrate/Competitorn/a
Meas. Tech.ChEMBL_69919 (CHEMBL682268)
IC50>20000±n/a nM
Citation Nair, MGMurthy, BRPatil, SDKisliuk, RLThorndike, JGaumont, YFerone, RDuch, DSEdelstein, MP Folate analogues. 31. Synthesis of the reduced derivatives of 11-deazahomofolic acid, 10-methyl-11-deazahomofolic acid, and their evaluation as inhibitors of glycinamide ribonucleotide formyltransferase. J Med Chem32:1277-83 (1989) Trifunctional purine biosynthetic protein adenosine-3
Name:Trifunctional purine biosynthetic protein adenosine-3
Type:Protein
Mol. Mass.:107768.47
Organism:Homo sapiens (Human)
Description:P22102
Residue:1010
BDBM50016661
NameBDBM50016661
Synonyms:2-{4-[3-(2-Amino-4-oxo-3,4-dihydro-pteridin-6-yl)-2-methyl-propyl]-benzoylamino}-pentanedioic acid | CHEMBL23872
TypeSmall organic molecule
Emp. Form.C22H24N6O6
Mol. Mass.468.4626
SMILESCC(Cc1ccc(cc1)C(=O)NC(CCC(O)=O)C(O)=O)Cc1cnc2nc(N)[nH]c(=O)c2n1