Reaction Details
TargetD(1A) dopamine receptor
LigandBDBM82247
Substrate/Competitorn/a
Meas. Tech.ChEMBL_58673 (CHEMBL670447)
Ki 0.390000±n/a nM
Citation Chumpradit, SKung, HFBillings, JKung, MPPan, S (+/-)-7-chloro-8-hydroxy-1-(4'-[125I]iodophenyl)-3-methyl-2,3,4,5- tetrahydro-1H-3-benzazepine: a potential CNS D-1 dopamine receptor imaging agent. J Med Chem32:1431-5 (1989) D(1A) dopamine receptor
Name:D(1A) dopamine receptor
Type:Enzyme Catalytic Domain
Mol. Mass.:49429.75
Organism:RAT
Description:P18901
Residue:446
BDBM82247
NameBDBM82247
Synonyms:8-Chloro-3-methyl-5-phenyl-2,3,4,5-tetrahydro-1H-benzo[d]azepin-7-ol(SCH 23390) CHEMBL2158641 SCH 23388 SCH 23390 (R-enantiomer) | SCH 23390,R(+)
TypeSmall organic molecule
Emp. Form.C17H18ClNO
Mol. Mass.287.784
SMILESCN1CCc2cc(Cl)c(O)cc2[C@H](C1)c1ccccc1