Reaction Details
TargetDihydrofolate reductase
LigandBDBM50008294
Substrate/Competitorn/a
Meas. Tech.ChEBML_54898
IC50 4900±n/a nM
Citation Patil, SDJones, CNair, MGGalivan, JMaley, FKisliuk, RLGaumont, YDuch, DFerone, R Folate analogues. 32. Synthesis and biological evaluation of 2-desamino-2-methyl-N10-propargyl-5,8-dideazafolic acid and related compounds. J Med Chem32:1284-9 (1989) Dihydrofolate reductase
Name:Dihydrofolate reductase
Type:PROTEIN
Mol. Mass.:18437.08
Organism:Lactobacillus casei
Description:ChEMBL_1357878
Residue:163
BDBM50008294
NameBDBM50008294
Synonyms:2-(4-(((2-amino-4-oxo-1,4-dihydroquinazolin-6-yl)methyl)(prop-2-ynyl)amino)benzamido)pentanedioic acid 2-{4-[(2-Amino-4-oxo-3,4-dihydro-quinazolin-6-ylmethyl)-prop-2-ynyl-amino]-benzoylamino}-pentanedioic acid 2-{4-[(2-Amino-4-oxo-3,4-dihydro-quinazolin-6-ylmethyl)-prop-2-ynyl-amino]-benzoylamino}-pentanedioic acid(N10-propargyl-5,8-dideazafolate, PDDF) CHEMBL422395 | PDDF
TypeSmall organic molecule
Emp. Form.C24H23N5O6
Mol. Mass.477.4693
SMILESNc1nc2ccc(CN(CC#C)c3ccc(cc3)C(=O)NC(CCC(O)=O)C(O)=O)cc2c(=O)[nH]1