Reaction Details
TargetHistamine H1 receptor
LigandBDBM50017371
Substrate/Competitorn/a
Meas. Tech.ChEBML_83773
IC50 8±n/a nM
Citation Walsh, DAFranzyshen, SKYanni, JM Synthesis and antiallergy activity of 4-(diarylhydroxymethyl)-1-[3-(aryloxy)propyl]piperidines and structurally related compounds. J Med Chem32:105-18 (1989) Histamine H1 receptor
Name:Histamine H1 receptor
Type:G Protein-Coupled Receptor (GPCR)
Mol. Mass.:55641.53
Organism:Cavia porcellus (domestic guinea pig)
Description:Guinea pig cerebellum was used in binding assay.
Residue:488
BDBM50017371
NameBDBM50017371
Synonyms:1-[4-(3-{4-[Bis-(4-fluoro-phenyl)-hydroxy-methyl]-piperidin-1-yl}-propoxy)-3-methoxy-phenyl]-ethanone | CHEMBL17436
TypeSmall organic molecule
Emp. Form.C30H33F2NO4
Mol. Mass.509.5841
SMILESCOc1cc(ccc1OCCCN1CCC(CC1)C(O)(c1ccc(F)cc1)c1ccc(F)cc1)C(C)=O