Reaction Details
TargetComplement factor D
LigandBDBM50333126
Substrate/Competitorn/a
Meas. Tech.ChEMBL_1734432 (CHEMBL4149968)
Kd 1000000±n/a nM
Citation Vulpetti, AOstermann, NRandl, SYoon, TMac Sweeney, ACumin, FLorthiois, ERüdisser, SErbel, PMaibaum, J Discovery and Design of First Benzylamine-Based Ligands Binding to an Unlocked Conformation of the Complement Factor D. ACS Med Chem Lett9:490-495 (2018) 
 
Complement factor D
Name:Complement factor D
Type:Protein
Mol. Mass.:27039.19
Organism:Homo sapiens (Human)
Description:P00746
Residue:253
BDBM50333126
NameBDBM50333126
Synonyms:CHEMBL4170489
TypeSmall organic molecule
Emp. Form.C17H16N4O2
Mol. Mass.308.3345
SMILESNCc1cccc(NC(=O)c2cccc3[nH]c(cc23)C(N)=O)c1