Reaction Details
TargetComplement factor D
LigandBDBM50330412
Substrate/Competitorn/a
Meas. Tech.ChEMBL_1734433 (CHEMBL4149969)
Kd 80000±n/a nM
Citation Vulpetti, AOstermann, NRandl, SYoon, TMac Sweeney, ACumin, FLorthiois, ERüdisser, SErbel, PMaibaum, J Discovery and Design of First Benzylamine-Based Ligands Binding to an Unlocked Conformation of the Complement Factor D. ACS Med Chem Lett9:490-495 (2018) 
 
Complement factor D
Name:Complement factor D
Type:Protein
Mol. Mass.:27039.19
Organism:Homo sapiens (Human)
Description:P00746
Residue:253
BDBM50330412
NameBDBM50330412
Synonyms:CHEMBL4161222
TypeSmall organic molecule
Emp. Form.C24H24N2O
Mol. Mass.356.4602
SMILESNCc1cccc(c1)-c1cccc(c1)C(=O)N[C@@H]1CCCc2ccccc12