Reaction Details
TargetD(1A) dopamine receptor
LigandBDBM50004823
Substrate/Competitorn/a
Meas. Tech.ChEBML_58666
Ki 1.9±n/a nM
Citation Berger, JGChang, WKClader, JWHou, DChipkin, REMcPhail, AT Synthesis and receptor affinities of some conformationally restricted analogues of the dopamine D1 selective ligand (5R)-8-chloro-2,3,4,5-tetrahydro-3-methyl-5-phenyl- 1H-3-benzazepin-7-ol. J Med Chem32:1913-21 (1989) D(1A) dopamine receptor
Name:D(1A) dopamine receptor
Type:Enzyme Catalytic Domain
Mol. Mass.:49429.75
Organism:RAT
Description:P18901
Residue:446
BDBM50004823
NameBDBM50004823
Synonyms:(6aS,13bR)-11-Chloro-7-methyl-5,6a,7,8,9,13b-hexahydro-6H-7-aza-benzo[6,7]cyclohepta[1,2-a]naphthalen-12-ol 11-Chloro-7-methyl-5,6a,7,8,9,13b-hexahydro-6H-7-aza-benzo[6,7]cyclohepta[1,2-a]naphthalen-12-ol Ecopipam trans-(-) 11-Chloro-7-methyl-5,6a,7,8,9,13b-hexahydro-6H-7-aza-benzo[6,7]cyclohepta[1,2-a]naphthalen-12-ol
TypeSmall organic molecule
Emp. Form.C19H20ClNO
Mol. Mass.313.821
SMILESCN1CCc2cc(Cl)c(O)cc2[C@@H]2[C@@H]1CCc1ccccc21