Reaction Details
TargetBromodomain and WD repeat-containing protein 1
LigandBDBM50366670
Substrate/Competitorn/a
Meas. Tech.ChEMBL_1735511 (CHEMBL4151047)
Kd>5000±n/a nM
Citation Zhao, YZhou, BBai, LLiu, LYang, CYMeagher, JLStuckey, JAMcEachern, DPrzybranowski, SWang, MRan, XAguilar, AHu, YKampf, JWLi, XZhao, TLi, SWen, BSun, DWang, S Structure-Based Discovery of CF53 as a Potent and Orally Bioavailable Bromodomain and Extra-Terminal (BET) Bromodomain Inhibitor. J Med Chem61:6110-6120 (2018) 
 
Bromodomain and WD repeat-containing protein 1
Name:Bromodomain and WD repeat-containing protein 1
Type:PROTEIN
Mol. Mass.:262994.15
Organism:Homo sapiens (Human)
Description:ChEMBL_109516
Residue:2320
BDBM50366670
NameBDBM50366670
Synonyms:CHEMBL4173488
TypeSmall organic molecule
Emp. Form.C24H25N7O2
Mol. Mass.443.501
SMILESCOc1cc2c(cc1-c1c(C)noc1C)[nH]c1nc(C)nc(Nc3cc(nn3C)C3CC3)c21