Reaction Details
TargetPeroxisomal N(1)-acetyl-spermine/spermidine oxidase
LigandBDBM50405928
Substrate/Competitorn/a
Meas. Tech.ChEBML_141590
Ki 75000±n/a nM
Citation Dredar, SABlankenship, JWMarchant, PEManneh, VFries, DS Design and synthesis of inhibitors of N8-acetylspermidine deacetylase. J Med Chem32:984-9 (1989) Peroxisomal N(1)-acetyl-spermine/spermidine oxidase
Name:Peroxisomal N(1)-acetyl-spermine/spermidine oxidase
Type:Enzyme
Mol. Mass.:70274.33
Organism:Homo sapiens (Human)
Description:Q6QHF9
Residue:511
BDBM50405928
NameBDBM50405928
Synonyms:CHEMBL174669
TypeSmall organic molecule
Emp. Form.C10H22N2O
Mol. Mass.186.2945
SMILESCC(=O)NCCCCCCCCN