Reaction Details
TargetPeroxisomal N(1)-acetyl-spermine/spermidine oxidase
LigandBDBM50405936
Substrate/Competitorn/a
Meas. Tech.ChEBML_141590
Ki 29000000±n/a nM
Citation Dredar, SABlankenship, JWMarchant, PEManneh, VFries, DS Design and synthesis of inhibitors of N8-acetylspermidine deacetylase. J Med Chem32:984-9 (1989) Peroxisomal N(1)-acetyl-spermine/spermidine oxidase
Name:Peroxisomal N(1)-acetyl-spermine/spermidine oxidase
Type:Enzyme
Mol. Mass.:70274.33
Organism:Homo sapiens (Human)
Description:Q6QHF9
Residue:511
BDBM50405936
NameBDBM50405936
Synonyms:CHEMBL177217
TypeSmall organic molecule
Emp. Form.C8H18N2O
Mol. Mass.158.2413
SMILESCCCC(=O)NCCCCN