Reaction Details
TargetFolylpolyglutamate synthase, mitochondrial
LigandBDBM50018235
Substrate/Competitorn/a
Meas. Tech.ChEBML_68383
Ki 1.7±n/a nM
Citation Patil, SAShane, BFreisheim, JHSingh, SKHynes, JB Inhibition of mammalian folylpolyglutamate synthetase and human dihydrofolate reductase by 5,8-dideaza analogues of folic acid and aminopterin bearing a terminal L-ornithine. J Med Chem32:1559-65 (1989) Folylpolyglutamate synthase, mitochondrial
Name:Folylpolyglutamate synthase, mitochondrial
Type:PROTEIN
Mol. Mass.:64621.95
Organism:Homo sapiens (Human)
Description:ChEMBL_68676
Residue:587
BDBM50018235
NameBDBM50018235
Synonyms:5-Amino-2-{4-[(2,4-diamino-5-chloro-quinazolin-6-ylmethyl)-amino]-benzoylamino}-pentanoic acid | CHEMBL38937
TypeSmall organic molecule
Emp. Form.C21H24ClN7O3
Mol. Mass.457.913
SMILESNCCCC(NC(=O)c1ccc(NCc2ccc3nc(N)nc(N)c3c2Cl)cc1)C(O)=O