Reaction Details
TargetALK tyrosine kinase receptor
LigandBDBM50044303
Substrate/Competitorn/a
Meas. Tech.ChEMBL_1738229 (CHEMBL4153979)
IC50 2.7±n/a nM
Citation Geng, KLiu, HSong, ZZhang, CZhang, MYang, HCao, JGeng, MShen, AZhang, A Design, synthesis and pharmacological evaluation of ALK and Hsp90 dual inhibitors bearing resorcinol and 2,4-diaminopyrimidine motifs. Eur J Med Chem152:76-86 (2018) 
 
ALK tyrosine kinase receptor
Name:ALK tyrosine kinase receptor
Type:Protein
Mol. Mass.:176453.10
Organism:Homo sapiens (Human)
Description:Q9UM73
Residue:1620
BDBM50044303
NameBDBM50044303
Synonyms:CHEMBL3357439
TypeSmall organic molecule
Emp. Form.C21H23ClN6O3S
Mol. Mass.474.964
SMILESCC(C)S(=O)(=O)c1ccccc1Nc1nc(Nc2cccc(NC(=O)CN)c2)ncc1Cl