Reaction Details
TargetDihydrofolate reductase
LigandBDBM50018478
Substrate/Competitorn/a
Meas. Tech.ChEMBL_54744 (CHEMBL667195)
Ki 0.500000±n/a nM
Citation Roth, BTidwell, MYFerone, RBaccanari, DPSigel, CWDeAngelis, DElwell, LP 2,4-Diamino-5-benzylpyrimidines as antibacterial agents. 13. Some alkenyl derivatives with high in vitro activity against anaerobic organisms. J Med Chem32:1949-58 (1989) Dihydrofolate reductase
Name:Dihydrofolate reductase
Type:n/a
Mol. Mass.:17532.46
Organism:Escherichia coli
Description:n/a
Residue:157
BDBM50018478
NameBDBM50018478
Synonyms:5-(3-Ethoxy-4,5-dimethoxy-benzyl)-pyrimidine-2,4-diamine TCMDC-137664
TypeSmall organic molecule
Emp. Form.C15H20N4O3
Mol. Mass.304.3443
SMILESCCOc1cc(Cc2cnc(N)nc2N)cc(OC)c1OC