Reaction Details
TargetDihydrofolate reductase
LigandBDBM50018472
Substrate/Competitorn/a
Meas. Tech.ChEBML_53150
Ki 1.4±n/a nM
Citation Roth, BTidwell, MYFerone, RBaccanari, DPSigel, CWDeAngelis, DElwell, LP 2,4-Diamino-5-benzylpyrimidines as antibacterial agents. 13. Some alkenyl derivatives with high in vitro activity against anaerobic organisms. J Med Chem32:1949-58 (1989) Dihydrofolate reductase
Name:Dihydrofolate reductase
Type:Enzyme
Mol. Mass.:18249.71
Organism:Staphylococcus aureus
Description:n/a
Residue:159
BDBM50018472
NameBDBM50018472
Synonyms:5-(3,4-Dimethoxy-5-propenyl-benzyl)-pyrimidine-2,4-diamine | CHEMBL23338
TypeSmall organic molecule
Emp. Form.C16H20N4O2
Mol. Mass.300.3556
SMILESCOc1cc(Cc2cnc(N)nc2N)cc(\C=C\C)c1OC