Reaction Details
TargetDihydrofolate reductase
LigandBDBM50018474
Substrate/Competitorn/a
Meas. Tech.ChEMBL_54422 (CHEMBL880683)
Ki 1.7±n/a nM
Citation Roth, BTidwell, MYFerone, RBaccanari, DPSigel, CWDeAngelis, DElwell, LP 2,4-Diamino-5-benzylpyrimidines as antibacterial agents. 13. Some alkenyl derivatives with high in vitro activity against anaerobic organisms. J Med Chem32:1949-58 (1989) Dihydrofolate reductase
Name:Dihydrofolate reductase
Type:n/a
Mol. Mass.:17532.46
Organism:Escherichia coli
Description:n/a
Residue:157
BDBM50018474
NameBDBM50018474
Synonyms:4-(2,4-Diamino-pyrimidin-5-ylmethyl)-2,6-dipropyl-phenol | CHEMBL23746
TypeSmall organic molecule
Emp. Form.C17H24N4O
Mol. Mass.300.3987
SMILESCCCc1cc(Cc2cnc(N)nc2N)cc(CCC)c1O