Reaction Details
TargetAcetylcholinesterase
LigandBDBM50449485
Substrate/Competitorn/a
Meas. Tech.ChEMBL_1739898 (CHEMBL4155648)
IC50 20±n/a nM
Citation ?în?a?, MLGembus, VAlix, FBarré, ACoadou, GTruong, LSebban, MPapamicaël, COulyadi, HLevacher, V Rational design of carbamate-based dual binding site and central AChE inhibitors by a "biooxidisable" prodrug approach: Synthesis, in vitro evaluation and docking studies. Eur J Med Chem155:171-182 (2018) 
 
Acetylcholinesterase
Name:Acetylcholinesterase
Type:Enzyme
Mol. Mass.:67792.70
Organism:Homo sapiens (Human)
Description:P22303
Residue:614
BDBM50449485
NameBDBM50449485
Synonyms:CHEMBL4160280
TypeSmall organic molecule
Emp. Form.C20H26IN3O3
Mol. Mass.483.3432
SMILES[I-].CN(C)C(=O)Oc1cccc2[n+](C)cc(cc12)C(=O)NC1CCCCC1