Reaction Details
TargetFatty-acid amide hydrolase 1 [30-579]
LigandBDBM50161525
Substrate/Competitorn/a
Meas. Tech.ChEMBL_1743265 (CHEMBL4177775)
Ki 0.520000±n/a nM
Citation Tuo, WLeleu-Chavain, NSpencer, JSansook, SMillet, RChavatte, P Therapeutic Potential of Fatty Acid Amide Hydrolase, Monoacylglycerol Lipase, and N-Acylethanolamine Acid Amidase Inhibitors. J Med Chem60:4-46 (2017) 
 
Fatty-acid amide hydrolase 1 [30-579]
Name:Fatty-acid amide hydrolase 1 [30-579]
Type:Single-pass membrane protein; homodimer
Mol. Mass.:60474.00
Organism:Rattus norvegicus (rat)
Description:P97612 (aa 30-579)
Residue:550
BDBM50161525
NameBDBM50161525
Synonyms:1-(oxazolo[4,5-b]pyridin-2-yl)-9-phenylnonan-1-one CHEMBL182199
TypeSmall organic molecule
Emp. Form.C21H24N2O2
Mol. Mass.336.4275
SMILESO=C(CCCCCCCCc1ccccc1)c1nc2ncccc2o1