Reaction Details
TargetFatty-acid amide hydrolase 1 [30-579]
LigandBDBM50350547
Substrate/Competitorn/a
Meas. Tech.ChEMBL_1743265 (CHEMBL4177775)
Ki 0.570000±n/a nM
Citation Tuo, WLeleu-Chavain, NSpencer, JSansook, SMillet, RChavatte, P Therapeutic Potential of Fatty Acid Amide Hydrolase, Monoacylglycerol Lipase, and N-Acylethanolamine Acid Amidase Inhibitors. J Med Chem60:4-46 (2017) 
 
Fatty-acid amide hydrolase 1 [30-579]
Name:Fatty-acid amide hydrolase 1 [30-579]
Type:Single-pass membrane protein; homodimer
Mol. Mass.:60474.00
Organism:Rattus norvegicus (rat)
Description:P97612 (aa 30-579)
Residue:550
BDBM50350547
NameBDBM50350547
Synonyms:CHEMBL257307
TypeSmall organic molecule
Emp. Form.C18H26N2O2
Mol. Mass.302.4112
SMILESCCCCCCCCCCCC(=O)c1nc2ncccc2o1