Reaction Details
TargetDelta-type opioid receptor
LigandBDBM50019056
Substrate/Competitorn/a
Meas. Tech.ChEBML_147185
Ki 7.3±n/a nM
Citation Gacel, GDaugé, VBreuzé, PDelay-Goyet, PRoques, BP Development of conformationally constrained linear peptides exhibiting a high affinity and pronounced selectivity for delta opioid receptors. J Med Chem31:1891-7 (1988) Delta-type opioid receptor
Name:Delta-type opioid receptor
Type:G Protein-Coupled Receptor (GPCR)
Mol. Mass.:40465.04
Organism:Rattus norvegicus (rat)
Description:Competition binding assays were using CHO-K1 cell membranes expressing the opioid receptor.
Residue:372
BDBM50019056
NameBDBM50019056
Synonyms:(S)-2-[(S)-2-(2-{2-[(S)-2-Amino-3-(4-hydroxy-phenyl)-propionylamino]-acetylamino}-acetylamino)-3-phenyl-propionylamino]-4-methylsulfanyl-butyric acid 2-[(S)-2-(2-{2-[(S)-2-Amino-3-(4-hydroxy-phenyl)-propionylamino]-acetylamino}-acetylamino)-1-oxo-3-phenyl-propylamino]-4-methylsulfanyl-butyric acid 2-[2-(2-{2-[2-Amino-3-(4-hydroxy-phenyl)-propionylamino]-acetylamino}-acetylamino)-3-phenyl-propionylamino]-4-methylsulfanyl-butyric acid H-Tyr-Gly-Gly-Phe-Met-OH [Met5]-enkephalin | met-enkephalin
TypeSmall organic molecule
Emp. Form.C27H35N5O7S
Mol. Mass.573.661
SMILESCSCC[C@H](NC(=O)[C@H](Cc1ccccc1)NC(=O)CNC(=O)CNC(=O)[C@@H](N)Cc1ccc(O)cc1)C(O)=O