Reaction Details
TargetDelta-type opioid receptor
LigandBDBM50019054
Substrate/Competitorn/a
Meas. Tech.ChEBML_147185
Ki 4.7±n/a nM
Citation Gacel, GDaugé, VBreuzé, PDelay-Goyet, PRoques, BP Development of conformationally constrained linear peptides exhibiting a high affinity and pronounced selectivity for delta opioid receptors. J Med Chem31:1891-7 (1988) Delta-type opioid receptor
Name:Delta-type opioid receptor
Type:G Protein-Coupled Receptor (GPCR)
Mol. Mass.:40465.04
Organism:Rattus norvegicus (rat)
Description:Competition binding assays were using CHO-K1 cell membranes expressing the opioid receptor.
Residue:372
BDBM50019054
NameBDBM50019054
Synonyms:2-{2-[2-(2-{2-[2-Amino-3-(4-hydroxy-phenyl)-propionylamino]-3-tert-butoxy-propionylamino}-acetylamino)-3-phenyl-propionylamino]-4-methyl-pentanoylamino}-3-tert-butoxy-butyric acid | CHEMBL56933
TypeSmall organic molecule
Emp. Form.C41H62N6O10
Mol. Mass.798.9652
SMILESCC(C)C[C@H](NC(=O)[C@H](Cc1ccccc1)NC(=O)CNC(=O)[C@@H](COC(C)(C)C)NC(=O)[C@@H](N)Cc1ccc(O)cc1)C(=O)N[C@@H]([C@@H](C)OC(C)(C)C)C(O)=O