Reaction Details
TargetTyrosine-protein kinase ABL1
LigandBDBM50451279
Substrate/Competitorn/a
Meas. Tech.ChEMBL_1744968 (CHEMBL4179478)
IC50 1120±n/a nM
Citation Romu, AALei, ZZhou, BChen, ZSKorlipara, V Design, synthesis and biological evaluation of WZ4002 analogues as EGFR inhibitors. Bioorg Med Chem Lett27:4832-4837 (2017) 
 
Tyrosine-protein kinase ABL1
Name:Tyrosine-protein kinase ABL1
Type:PROTEIN
Mol. Mass.:122698.35
Organism:Mus musculus
Description:ChEMBL_767349
Residue:1123
BDBM50451279
NameBDBM50451279
Synonyms:CHEMBL4207305
TypeSmall organic molecule
Emp. Form.C24H27ClN6O4
Mol. Mass.498.962
SMILESCOc1cc(ccc1Nc1ncc(Cl)c(Oc2cccc(NC(=O)CO)c2)n1)N1CCN(C)CC1