Reaction Details
TargetTyrosine-protein kinase ABL1
LigandBDBM50451297
Substrate/Competitorn/a
Meas. Tech.ChEMBL_1744968 (CHEMBL4179478)
IC50 3410±n/a nM
Citation Romu, AALei, ZZhou, BChen, ZSKorlipara, V Design, synthesis and biological evaluation of WZ4002 analogues as EGFR inhibitors. Bioorg Med Chem Lett27:4832-4837 (2017) 
 
Tyrosine-protein kinase ABL1
Name:Tyrosine-protein kinase ABL1
Type:PROTEIN
Mol. Mass.:122698.35
Organism:Mus musculus
Description:ChEMBL_767349
Residue:1123
BDBM50451297
NameBDBM50451297
Synonyms:CHEMBL4216551
TypeSmall organic molecule
Emp. Form.C28H34ClN7O3
Mol. Mass.552.068
SMILESCOc1cc(ccc1Nc1ncc(Cl)c(Oc2ccc(NC(=O)\C=C\CN(C)C)cc2)n1)N1CCN(C)CC1